{"text_format":"1","workbook":"xlsx","n_sheets":14,"sheets":["Revisão","Flat Forward","Spline","ETTJ","Planilha1","COPOM","COPOM 1","COPOM 2","021015","091015","141015","161015","Feriado","Curva CC"],"not_rendered":{"charts":13,"images":0,"macros":1,"external_links":1,"defined_names":2,"comments":0,"pivot_tables":0},"unopened":[],"bounds":{"document_bytes":16777216,"sheet_cells":100000,"rows_first":2000,"rows_last":500,"rows_between":2000,"halvings":0,"cell_chars":16384,"cell_head_chars":4096},"cells_cut":0,"cells_raw":0,"read":"whole","date_system":"1900"}

{"sheet":"Revisão","index":0,"n_rows":29,"n_cols":18,"rows_kept":29,"cut":false,"hidden":false,"merged":[[2,1,2,3],[2,5,2,7],[2,9,2,11]]}
[null,"Taxas Equivalentes"]
[]
[null,"DIAS ÚTEIS",null,null,null,"DIAS CORRIDOS",null,null,null,"Taxa Nominal Mensal",null,null,1,"Calcule as taxas efetivas no período para:"]
[]
[null,"taxa ano",{"$f":"Q5","v":8.5},"%a.a.",null,"taxa ano",{"$f":"Q6","v":11.3},"%a.a.",null,"Tx nominal",{"$f":"Q7","v":9.1999999999999993},"%a.a.",null,"Du 252",123,"du",8.5,"% a.a."]
[null,"prazo",{"$f":"O5","v":123},"du",null,"prazo",{"$f":"O6","v":450},"dc",null,"prazo",{"$f":"O7","v":135},"dc",null,"DC 360",450,"dc",11.3,"% a.a."]
[null,null,null,null,null,null,null,null,null,"Tx ef. Semestral",{"$f":"K5/2","v":4.5999999999999996},null,null,"TX  nominal semestral",135,"dc",9.1999999999999993,"% a.a."]
[null,null,{"$f":"((1+C5/100)^(C6/252)-1)*100","v":4.0622199669615},{"$f":"\"% em \"&C6&\" du\"","v":"% em 123 du"},null,null,{"$f":"((1+G5/100)^(G6/360)-1)*100","v":14.319141772485366},{"$f":"\"% em \"&G6&\" dc\"","v":"% em 450 dc"}]
[null,null,null,null,null,null,null,null,null,null,{"$f":"((1+K7/100)^(K6/180)-1)*100","v":3.4305331654852944},{"$f":"\"% em \"&K6&\" dc\"","v":"% em 135 dc"}]
[]
{"$rows_left_out":20}
{"sheet":"Flat Forward","index":1,"n_rows":33,"n_cols":15,"rows_kept":33,"cut":false,"hidden":false,"merged":[[14,6,14,7],[14,8,14,10],[15,6,15,10],[20,6,20,9],[30,13,30,14],[27,13,27,14],[21,6,21,7],[21,8,21,9],[27,8,27,9],[30,8,30,9]]}
[null,"Cálculo da taxa a termo",null,null,null,null,"Calcule os termos:",null,null,"Calcule as taxas equivalentes (%a.a.) para:"]
[]
["tc","tl","DU","Tx Spot","Termo",null,"T2",{"$f":"E6","v":14.99},null,30,14.36]
["a",null,19,14.26,{"$f":"D4","v":14.26},null,"T3",{"$f":"E7","v":15.19},null,60,14.6]
["b","a",40,14.4,14.53,"T1","T4",15.5,null,90,14.82]
["c","b",62,14.61,14.99,"T2",null,null,null,75,14.71]
["d","c",82,14.75,15.19,"T3"]
["e","d",101,14.89,15.5,"T4"]
[]
[]
{"$rows_left_out":24}
{"sheet":"Spline","index":2,"n_rows":1819,"n_cols":7,"rows_kept":1819,"cut":false,"hidden":false,"merged":[]}
["DU","TX",null,null,null,"DU","SPLINE"]
[19,{"$f":"VLOOKUP(Spline!A2,ETTJ!$C$2:$D$33,2)","v":14.26},null,null,null,1,{"$f":"Cubic_Spline($A$2:$A$12,$B$2:$B$12,F2)","v":14.130299427068945}]
[82,{"$f":"VLOOKUP(Spline!A3,ETTJ!$C$2:$D$33,2)","v":14.75},null,null,null,2,{"$f":"Cubic_Spline($A$2:$A$12,$B$2:$B$12,F3)","v":14.137598747684727}]
[143,{"$f":"VLOOKUP(Spline!A4,ETTJ!$C$2:$D$33,2)","v":15.31},null,null,null,3,14.144882056422169]
[251,{"$f":"VLOOKUP(Spline!A5,ETTJ!$C$2:$D$33,2)","v":15.72},null,null,null,4,14.152150295156474]
[437,{"$f":"VLOOKUP(Spline!A6,ETTJ!$C$2:$D$33,2)","v":15.89},null,null,null,5,14.159402498414204]
[623,{"$f":"VLOOKUP(Spline!A7,ETTJ!$C$2:$D$33,2)","v":15.92},null,null,null,6,14.166645330116451]
[812,{"$f":"VLOOKUP(Spline!A8,ETTJ!$C$2:$D$33,2)","v":15.89},null,null,null,7,14.173872102743882]
[1001,{"$f":"VLOOKUP(Spline!A9,ETTJ!$C$2:$D$33,2)","v":15.83},null,null,null,8,14.18108948021759]
[1188,{"$f":"VLOOKUP(Spline!A10,ETTJ!$C$2:$D$33,2)","v":15.76},null,null,null,9,14.18829649706414]
{"$rows_left_out":1810}
{"sheet":"ETTJ","index":3,"n_rows":108,"n_cols":32,"rows_kept":108,"cut":false,"hidden":false,"merged":[]}
["Ticker","Data","2015-10-02","Last","Settle Px","Time","Bid","Ask","Open Int","Volume","Yest Settle","Curva","Spline","Termo"]
["ODX5 ","2015-11-02",{"$f":"NETWORKDAYS($C$1,B2,Feriados)-1","v":19},14.26,14.292999999999999,"9:51:29 AM",14.255000000000001,14.31,1060356,40,14.292999999999999,{"$f":"$S$28*C2^6+$S$29*C2^5+$S$30*C2^4+$S$31*C2^3+$S$32*C2^2+$S$33*C2+$S$41","v":14.173905940922104},{"$f":"Cubic_Spline($C$2:$C$33,$D$2:$D$33,C2)","v":14.260000228881836},{"$f":"D2","v":14.26}]
["ODZ5 ","2015-12-01",{"$f":"NETWORKDAYS($C$1,B3,Feriados)-1","v":40},14.4,14.43,"9:52:57 AM",14.39,14.4,665740,8530,14.43,14.419154389192695,{"$f":"Cubic_Spline($C$2:$C$33,$D$2:$D$33,C3)","v":14.399999618530273},{"$f":"ROUND(((((1+D3/100)^(C3/252))/((1+D2/100)^(C2/252)))^(252/(C3-C2))-1)*100,2)","v":14.53}]
["ODF6 ","2016-01-04",62,14.61,14.68,"9:55:15 AM",14.605,14.61,3487879,29270,14.68,14.646236674151842,14.609999656677246,{"$f":"ROUND(((((1+D4/100)^(C4/252))/((1+D3/100)^(C3/252)))^(252/(C4-C3))-1)*100,2)","v":14.99}]
["ODG6 ","2016-02-01",82,14.75,14.85,"10/1/2015",14.7,14.79,114485,120,14.775,14.828519384379106,14.75,15.19]
["ODH6 ","2016-03-01",101,14.89,15,"10/1/2015",14.8,14.984999999999999,70015,865,14.9,14.982255141502884,14.890000343322754,15.5]
["ODJ6 ","2016-04-01",123,15.14,15.22,"9:52:23 AM",15.12,15.14,1096753,165,15.22,15.138743714553121,15.140000343322754,16.29]
["ODK6 ","2016-05-02",143,15.31,15.35,"10/1/2015",15.185,"#N/A N/A",52245,2610,15.25,15.262820810999013,15.310000419616699,16.36]
["ODM6 ","2016-06-01",164,15.44,15.505000000000001,"10/1/2015","#N/A N/A","#N/A N/A",52145,700,15.38,15.376293584193247,15.439999580383301,16.329999999999998,null,null,null,null,null,null,null,null,null,null,null,null,null,null,"DU",2,9,14]
["ODN6 ","2016-07-01",186,15.54,15.58,"9:55:20 AM",15.404999999999999,15.44,901521,140,15.58,15.478569133838423,15.539999961853027,{"$f":"ROUND(((((1+D10/100)^(C10/252))/((1+D9/100)^(C9/252)))^(252/(C10-C9))-1)*100,2)","v":16.29},null,null,null,null,null,null,null,null,null,null,null,null,null,null,{"$f":"C4","v":62},{"$f":"D4","v":14.61},{"$f":"'091015'!S4","v":14.320006985598877},{"$f":"'141015'!S4","v":14.350014299459923}]
{"$rows_left_out":99}
{"sheet":"Planilha1","index":4,"n_rows":40,"n_cols":11,"rows_kept":40,"cut":false,"hidden":false,"merged":[]}
[]
[]
[]
[]
[null,null,null,null,null,null,null,null,null,"2022-03-01",10.99]
[null,null,null,null,null,null,null,null,null,"2022-05-01",11.254]
[null,null,null,null,null,null,null,null,null,"2022-05-01",11.55]
[null,null,null,null,null,null,null,null,null,"2022-06-01",11.74]
[null,null,null,null,null,null,null,null,null,"2022-07-01",11.89]
[null,null,null,null,null,null,null,null,null,"2022-08-01",12.06]
{"$rows_left_out":31}
{"sheet":"COPOM","index":5,"n_rows":34,"n_cols":25,"rows_kept":34,"cut":false,"hidden":false,"merged":[[11,3,11,4],[11,8,11,9],[11,13,11,14],[11,18,11,19],[14,3,14,4],[14,8,14,9],[14,13,14,14],[14,18,14,19],[28,3,28,4],[28,8,28,9],[28,13,28,14],[31,3,31,4],[31,8,31,9],[31,13,31,14]]}
[null,null,"DATA"]
[null,null,"2022-09-18",null,null,"ETTJ",null,null,null,null,null,null,null,"Reuniões Copom"]
[null,null,null,null,"tc","tl","DU","Tx Spot","Termo",null,null,null,"Termo","#","DU"]
[null,null,null,null,"a",null,0,13.65,{"$f":"H4","v":13.65},"spot"]
[null,null,"2022-10-01",null,"b","a",{"$f":"NETWORKDAYS($C$2,C5,Feriados)-1","v":9},13.72,{"$f":"H5","v":13.72},"TX CURTA",null,"2022-09-21","a","R1",{"$f":"NETWORKDAYS($C$2,L5,Feriados)-1","v":2},null,null,null,null,null,null,null,null,0,{"$f":"J22","v":13.65}]
[null,null,"2022-11-02",null,"c","b",{"$f":"NETWORKDAYS($C$2,C6,Feriados)-1","v":30},13.74,{"$f":"C17","v":13.75},"T1",null,"2022-10-26","b","R2",{"$f":"NETWORKDAYS($C$2,L6,Feriados)-1","v":26},null,null,null,null,null,null,null,null,26,{"$f":"J22","v":13.65}]
[null,null,"2022-12-01",null,"d","c",{"$f":"NETWORKDAYS($C$2,C7,Feriados)-1","v":50},13.78,{"$f":"H17","v":13.84},"T2",null,"2022-12-07","d","R3",{"$f":"NETWORKDAYS($C$2,L7,Feriados)-1","v":54},null,null,null,null,null,null,null,null,26,{"$f":"J23","v":13.74}]
[null,null,"2023-01-01",null,"e","d",{"$f":"NETWORKDAYS($C$2,C8,Feriados)-1","v":71},13.8,{"$f":"M17","v":13.85},"T3",null,null,null,null,null,null,null,null,null,null,null,null,null,60,{"$f":"J23","v":13.74}]
[null,null,"2023-02-01",null,"f","e",{"$f":"NETWORKDAYS($C$2,C9,Feriados)-1","v":94},13.81,{"$f":"R17","v":13.84},"T3",null,null,null,null,null,null,null,null,null,null,null,null,null,60,{"$f":"J24","v":13.79}]
[null,null,null,null,null,null,null,null,null,null,null,null,null,null,null,null,null,null,null,null,null,null,null,89,{"$f":"J24","v":13.79}]
{"$rows_left_out":25}
{"sheet":"COPOM 1","index":6,"n_rows":34,"n_cols":25,"rows_kept":34,"cut":false,"hidden":false,"merged":[[11,3,11,4],[11,8,11,9],[11,13,11,14],[11,18,11,19],[14,3,14,4],[14,8,14,9],[14,13,14,14],[14,18,14,19],[28,3,28,4],[28,8,28,9],[28,13,28,14],[31,3,31,4],[31,8,31,9],[31,13,31,14]]}
[null,null,"DATA"]
[null,null,"2011-03-12",null,null,"ETTJ",null,null,null,null,null,null,null,"Reuniões Copom"]
[null,null,null,null,"tc","tl","DU","Tx Spot","Termo",null,null,null,"Termo","#","DU"]
[null,null,null,null,"a",null,0,11.66,11.66,"spot"]
[null,null,"2011-04-01",null,"b","a",{"$f":"NETWORKDAYS($C$2,C5,Feriados)-1","v":14},11.66,{"$f":"H5","v":11.66},"TX CURTA",null,"2011-04-20","b","R1",{"$f":"NETWORKDAYS($C$2,L5,Feriados)-1","v":27},null,null,null,null,null,null,null,null,0,{"$f":"J22","v":11.66}]
[null,null,"2011-05-02",null,"c","b",{"$f":"NETWORKDAYS($C$2,C6,Feriados)-1","v":33},11.75,{"$f":"C17","v":11.82},"T1",null,"2011-06-08","c","R2",{"$f":"NETWORKDAYS($C$2,L6,Feriados)-1","v":60},null,null,null,null,null,null,null,null,26,{"$f":"J22","v":11.66}]
[null,null,"2011-07-01",null,"d","c",{"$f":"NETWORKDAYS($C$2,C7,Feriados)-1","v":76},12.1,{"$f":"H17","v":12.37},"T2",null,"2011-07-20","d","R3",{"$f":"NETWORKDAYS($C$2,L7,Feriados)-1","v":89},null,null,null,null,null,null,null,null,26,{"$f":"J23","v":12.17}]
[null,null,"2011-08-01",null,"e","d",{"$f":"NETWORKDAYS($C$2,C8,Feriados)-1","v":97},12.21,{"$f":"M17","v":12.61},"T3",null,null,null,null,null,null,null,null,null,null,null,null,null,60,{"$f":"J23","v":12.17}]
[null,null,null,null,null,null,null,null,null,null,null,null,null,null,null,null,null,null,null,null,null,null,null,60,{"$f":"J24","v":12.71}]
[null,null,null,null,null,null,null,null,null,null,null,null,null,null,null,null,null,null,null,null,null,null,null,89,{"$f":"J24","v":12.71}]
{"$rows_left_out":25}
{"sheet":"COPOM 2","index":7,"n_rows":34,"n_cols":25,"rows_kept":34,"cut":false,"hidden":false,"merged":[[11,3,11,4],[11,8,11,9],[11,13,11,14],[11,18,11,19],[14,3,14,4],[14,8,14,9],[14,13,14,14],[14,18,14,19],[28,3,28,4],[28,8,28,9],[28,13,28,14],[31,3,31,4],[31,8,31,9],[31,13,31,14]]}
[null,null,"DATA"]
[null,null,"2015-10-02",null,null,"ETTJ",null,null,null,null,null,null,null,"Reuniões Copom"]
[null,null,null,null,"tc","tl","DU","Tx Spot","Termo",null,null,null,"Termo","#","DU"]
[null,null,"2015-10-21",null,"a",null,{"$f":"NETWORKDAYS($C$2,C4,Feriados)-1","v":12},14.13,{"$f":"H4","v":14.13},"spot"]
[null,null,"2015-11-02",null,"b","a",{"$f":"NETWORKDAYS($C$2,C5,Feriados)-1","v":19},{"$f":"Cubic_Spline('021015'!$R$2:$R$13,'021015'!$S$2:$S$13,G5)","v":14.228569984436035},{"$f":"C17","v":14.4},"TX CURTA",null,"2015-10-21","a","R1",{"$f":"NETWORKDAYS($C$2,L5,Feriados)-1","v":12},null,null,null,null,null,null,null,null,0,{"$f":"J22","v":14.13}]
[null,null,"2015-12-01",null,"c","b",{"$f":"NETWORKDAYS($C$2,C6,Feriados)-1","v":40},{"$f":"Cubic_Spline('021015'!$R$2:$R$13,'021015'!$S$2:$S$13,G6)","v":14.329986572265625},{"$f":"H17","v":14.42},"T1",null,"2015-11-25","b","R2",{"$f":"NETWORKDAYS($C$2,L6,Feriados)-1","v":36},null,null,null,null,null,null,null,null,26,{"$f":"J22","v":14.13}]
[null,null,"2016-01-04",null,"d","c",{"$f":"NETWORKDAYS($C$2,C7,Feriados)-1","v":62},{"$f":"Cubic_Spline('021015'!$R$2:$R$13,'021015'!$S$2:$S$13,G7)","v":14.540019035339355},{"$f":"M17","v":14.92},"T2",null,"2016-01-20","d","R3",{"$f":"NETWORKDAYS($C$2,L7,Feriados)-1","v":74},null,null,null,null,null,null,null,null,26,{"$f":"J23","v":14.4}]
[null,null,"2016-02-01",null,"e","d",{"$f":"NETWORKDAYS($C$2,C8,Feriados)-1","v":82},{"$f":"Cubic_Spline('021015'!$R$2:$R$13,'021015'!$S$2:$S$13,G8)","v":14.675000190734863},{"$f":"R17","v":15.09},"T3",null,null,null,null,null,null,null,null,null,null,null,null,null,60,{"$f":"J23","v":14.4}]
[null,null,null,null,null,null,null,null,null,null,null,null,null,null,null,null,null,null,null,null,null,null,null,60,{"$f":"J24","v":14.51}]
[null,null,null,null,null,null,null,null,null,null,null,null,null,null,null,null,null,null,null,null,null,null,null,89,{"$f":"J24","v":14.51}]
{"$rows_left_out":25}
{"sheet":"021015","index":8,"n_rows":35,"n_cols":21,"rows_kept":35,"cut":false,"hidden":false,"merged":[]}
["2015-10-02","VENCTO","CONTR. ABERT.(1)","CONTR. FECH.(2)","NÚM. NEGOC.","CONTR. NEGOC.","VOL.","AJUSTE ANTER. (3)","AJUSTE CORRIG. (4)","PREÇO ABERTU.","PREÇO MÍN.","PREÇO MÁX.","PREÇO MÉD.","ÚLT. PREÇO","AJUSTE","VAR. PTOS."]
["ODX5 ","X15",1060356,1124936,76,95570,9456585203,98944.76,99001.91,14.255000000000001,14.13,"14,270",14.234999999999999,14.2,99002,"5,24+","2015-11-02",{"$f":"NETWORKDAYS($A$1,Q2,Feriados)-1","v":19},{"$f":"((100000/O2)^(252/R2)-1)*100","v":14.228569584923022},{"$f":"'091015'!S2","v":14.097362731791584},{"$f":"'141015'!S2","v":14.13}]
["ODZ5 ","Z15",665740,689025,218,31100,3044408984,97882.13,97948.1,14.41,14.27,"14,410",14.372,14.27,97896.74,"14,61+","2015-12-01",40,{"$f":"((100000/O3)^(252/R3)-1)*100","v":14.329986402481797},{"$f":"'091015'!S3","v":14.199990646187533},{"$f":"'141015'!S3","v":14.189969913349486}]
["ODF6 ","F16",3487879,3493188,2722,302326,29238108221,96684.27,96765.92,14.62,14.4,"14,630",14.561999999999999,14.430999999999999,96715.18,"30,91+","2016-01-04",62,14.540019221889766,{"$f":"'091015'!S4","v":14.320006985598877},{"$f":"'141015'!S4","v":14.350014299459923}]
["ODG6 ","G16",114485,113920,24,1520,145376486,95592.26,95692.26,14.7,14.6,"14,700",14.673999999999999,14.6,95642.09,"49,83+","2016-02-01",82,14.675000037727148,{"$f":"'091015'!S5","v":14.479993013234438},{"$f":"'141015'!S5","v":14.539985763268071}]
["ODH6 ","H16",70015,70215,12,685,64814632,94549.57,94668.06,14.81,14.76,"14,810",14.795999999999999,14.76,94618.42,"68,85+","2016-03-01",101,14.799986945985344,{"$f":"'091015'!S6","v":14.639994948307432},{"$f":"'141015'!S6","v":14.659984128514303}]
["ODJ6 ","J16",1096753,1105600,304,41594,3884280016,93315.15,93442.86,15.154999999999999,14.945,"15,155",15.051,14.984999999999999,93393.87,"78,72+","2016-04-01",123,15.030005531501111,{"$f":"'091015'!S7","v":14.829993453561929},{"$f":"'141015'!S7","v":14.839999117512503}]
["ODK6 ","K16",52245,52265,4,320,29556851,92212.36,92368.28,15.21,15.005000000000001,"15,210",15.022,15.005000000000001,92319.85,"107,49+","2016-05-02",143,15.121993820601087,{"$f":"'091015'!S8","v":15.015006271105102},{"$f":"'141015'!S8","v":14.999988562853694}]
["ODM6 ","M16",52145,51110,13,2930,267094663,91041.45,91253,15.37,15.195,"15,370",15.285,15.195,91205.15,"163,70+","2016-06-01",164,15.195009089535926,{"$f":"'091015'!S9","v":15.149994602979454},{"$f":"'141015'!S9","v":15.164990028359782}]
["ODN6 ","N16",901521,902499,1190,32805,2952012252,89859.67,90095.5,15.525,15.21,"15,525",15.367000000000001,15.244999999999999,90048.26,"188,59+","2016-07-01",186,15.259993678264671,{"$f":"'091015'!S10","v":15.210008299880995},{"$f":"'141015'!S10","v":15.259998228202786}]
{"$rows_left_out":26}
{"sheet":"091015","index":9,"n_rows":35,"n_cols":19,"rows_kept":35,"cut":false,"hidden":false,"merged":[[47,1,47,17]]}
["2015-10-09","VENCTO","CONTR. ABERT.(1)","CONTR. FECH.(2)","NÚM. NEGOC.","CONTR. NEGOC.","VOL.","AJUSTE ANTER. (3)","AJUSTE CORRIG. (4)","PREÇO ABERTU.","PREÇO MÍN.","PREÇO MÁX.","PREÇO MÉD.","ÚLT. PREÇO","AJUSTE","VAR. PTOS."]
["ODX5 ","X15",1233527,1263042,19,48045,4766746967,99214.77,99266.15,14.17,14.154999999999999,14.173999999999999,14.172000000000001,14.154999999999999,99270,"0,67-","2015-11-02",{"$f":"NETWORKDAYS($A$1,Q2,Feriados)-1","v":14},{"$f":"((100000/O2)^(252/R2)-1)*100","v":14.097362731791584}]
["ODZ5 ","Z15",719678,729113,5,12345,1211945644,98174.82,98224.22,14.2,14.19,14.2,14.198,14.2,98172.72,"2,10-","2015-12-01",35,{"$f":"((100000/O3)^(252/R3)-1)*100","v":14.199990646187533}]
["ODF6 ","F16",3512339,3618127,2258,209740,20348340969,97017.39,97069.119999999995,14.302,14.27,14.38,14.326000000000001,14.305,97018.22,"0,83+","2016-01-04",57,14.320006985598877]
["ODG6 ","G16",113485,113460,6,385,36941589,95984.76,96002.52,14.48,14.48,14.48,14.48,14.48,95952.18,"32,58-","2016-02-01",77,14.479993013234438]
["ODH6 ","H16",69025,69300,6,550,52210570,94953.74,94978.11,14.64,14.64,14.64,14.64,14.64,94928.31,"25,43-","2016-03-01",96,14.639994948307432]
["ODJ6 ","J16",1077872,1074190,799,71180,6672570712,93748.97,93779.22,14.74,14.734999999999999,14.87,14.798,14.82,93730.05,"18,92-","2016-04-01",118,14.829993453561929]
["ODK6 ","K16",48480,48800,8,820,75952754,92671.37,92673.9,15.015000000000001,15.015000000000001,15.015000000000001,15.015000000000001,15.015000000000001,92625.31,"46,06-","2016-05-02",138,15.015006271105102]
["ODM6 ","M16",51905,51810,4,545,49858807,91541.4,91532.04,15.15,15.15,15.15,15.15,15.15,91484.05,"57,35-","2016-06-01",159,15.149994602979454]
["ODN6 ","N16",890131,904531,1224,35395,3198017517,90406.48,90377.89,15.015000000000001,14.95,15.33,15.170999999999999,15.225,90330.5,"75,98-","2016-07-01",181,15.210008299880995]
{"$rows_left_out":26}
{"sheet":"141015","index":10,"n_rows":35,"n_cols":19,"rows_kept":35,"cut":false,"hidden":false,"merged":[]}
["2015-10-14","VENCTO","CONTR. ABERT.(1)","CONTR. FECH.(2)","NÚM. NEGOC.","CONTR. NEGOC.","VOL.","AJUSTE ANTER. (3)","AJUSTE CORRIG. (4)","PREÇO ABERTU.","PREÇO MÍN.","PREÇO MÁX.","PREÇO MÉD.","ÚLT. PREÇO","AJUSTE","VAR. PTOS."]
["ODX5 ","X15",1268216,1296761,27,37355,3710070837,"99.319,49","99.371,34","14,155","14,151","14,161","14,158","14,151","99.319,24","0,25-","2015-11-02",{"$f":"NETWORKDAYS($A$1,Q2,Feriados)-1","v":12},14.13]
["ODZ5 ","Z15",750206,755081,29,12250,1203885926,"98.275,99","98.328,92","14,205","14,185","14,205","14,198","14,185","98.277,36","1,37+","2015-12-01",33,{"$f":"((100000/O3)^(252/R3)-1)*100","v":14.189969913349486}]
["ODF6 ","F16",3647128,3693218,725,126110,12247272207,"97.111,25","97.166,71","14,350","14,330","14,400","14,350","14,341","97.115,76","4,51+","2016-01-04",55,14.350014299459923]
["ODG6 ","G16",113345,115545,13,3825,367361403,"96.029,26","96.090,62","14,520","14,520","14,540","14,532","14,540","96.040,24","10,98+","2016-02-01",75,14.539985763268071]
["ODH6 ","H16",69088,68903,94,4075,387235835,"95.012,44","95.074,97","14,670","14,630","14,670","14,653","14,630","95.025,12","12,68+","2016-03-01",94,14.659984128514303]
["ODJ6 ","J16",1064194,1063411,355,33965,3186454575,"93.800,36","93.878,43","14,910","14,805","14,950","14,876","14,830","93.829,21","28,85+","2016-04-01",116,14.839999117512503]
["ODK6 ","K16",46025,44050,86,8790,815041003,"92.705,65","92.783,39","15,050","14,990","15,050","15,025","14,990","92.734,74","29,09+","2016-05-02",136,14.999988562853694]
["ODM6 ","M16",52110,52505,5,905,82879085,"91.538,45","91.627,14","15,165","15,165","15,165","15,165","15,165","91.579,10","40,65+","2016-06-01",157,15.164990028359782]
["ODN6 ","N16",905809,913231,1405,41720,3770084348,"90.339,09","90.451,63","15,390","15,185","15,400","15,328","15,195","90.404,20","65,11+","2016-07-01",179,15.259998228202786]
{"$rows_left_out":26}
{"sheet":"161015","index":11,"n_rows":47,"n_cols":19,"rows_kept":47,"cut":false,"hidden":false,"merged":[]}
["2015-10-16","VENCTO","CONTR. ABERT.(1)","CONTR. FECH.(2)","NÚM. NEGOC.","CONTR. NEGOC.","VOL.","AJUSTE ANTER. (3)","AJUSTE CORRIG. (4)","PREÇO ABERTU.","PREÇO MÍN.","PREÇO MÁX.","PREÇO MÉD.","ÚLT. PREÇO","AJUSTE","VAR. PTOS."]
["ODX5 ","X15",1328201,1334295,16,11640,1157294244,"99.423,86","99.476,06",14.169,14.145,14.169,14.151999999999999,14.15,99423.9,"0,04+","2015-11-02",{"$f":"NETWORKDAYS($A$1,Q2,Feriados)-1","v":10},14.13]
["ODZ5 ","Z15",770361,774376,36,22675,2230803967,"98.382,89","98.434,11",14.18,14.175000000000001,14.2,14.183,14.2,98382.5,"0,39-","2015-12-01",31,{"$f":"((100000/O3)^(252/R3)-1)*100","v":14.174992411634801}]
["ODF6 ","F16",3708380,3749853,1352,146175,14212003219,"97.230,27","97.276,61",14.301,14.281000000000001,14.379,14.311999999999999,14.35,97225.61,"4,66-","2016-01-04",53,14.314000738768762]
["ODG6 ","G16",114965,115430,36,3810,366396234,"96.179,40","96.220,98",14.455,14.39,14.46,14.445,14.45,96170.53,"8,87-","2016-02-01",73,14.430003841500593]
["ODH6 ","H16",69113,69149,3,40,3806467,"95.169,49","95.209,18",14.55,14.55,14.55,14.55,14.55,95159.26,"10,23-","2016-03-01",92,14.557985516646511]
["ODJ6 ","J16",1068722,1070457,238,30361,2853236942,"93.982,30","94.024,19",14.7,14.69,14.84,14.718999999999999,14.84,93974.89,"7,41-","2016-04-01",114,14.725000634407049]
["ODK6 ","K16",44465,45080,11,715,66428083,"92.917,13","92.955,15",14.84,14.84,14.84,14.84,14.84,92906.41,"10,72-","2016-05-02",134,14.840004552489884]
["ODM6 ","M16",53625,54035,10,1510,138554217,"91.777,19","91.805,90",15.01,15.01,15.01,15.01,15.01,91757.759999999995,"19,43-","2016-06-01",155,15.009991652656684]
["ODN6 ","N16",903028,889398,887,46675,4228375046,"90.605,37","90.642,03",15.12,15.03,15.27,15.105,15.26,90594.5,"10,87-","2016-07-01",177,15.100008905189988]
{"$rows_left_out":38}
{"sheet":"Feriado","index":12,"n_rows":62,"n_cols":12,"rows_kept":62,"cut":false,"hidden":false,"merged":[]}
[39814,39867,39868,39913,39924,39934,39975,40063,40098,40119,40132,40172]
[40179,40224,40225,40270,40289,40299,40332,40428,40463,40484,40497,40537]
[40544,40609,40610,40654,40655,40664,40717,40793,40828,40849,40862,40902]
[40909,40959,40960,41005,41020,41030,41067,41159,41194,41215,41228,41268]
[41275,41316,41317,41362,41385,41395,41424,41524,41559,41580,41593,41633]
[41640,41701,41702,41747,41750,41760,41809,41889,41924,41945,41958,41998]
[42005,42051,42052,42097,42115,42125,42159,42254,42289,42310,42323,42363]
[42370,42408,42409,42454,42481,42491,42516,42620,42655,42676,42689,42729]
[42736,42793,42794,42839,42846,42856,42901,42985,43020,43041,43054,43094]
[43101,43143,43144,43189,43211,43221,43251,43350,43385,43406,43419,43459]
{"$rows_left_out":53}
{"sheet":"Curva CC","index":13,"n_rows":50,"n_cols":18,"rows_kept":50,"cut":false,"hidden":false,"merged":[[22,0,22,1]]}
["Liq.","2014-04-16",null,"DÓLAR",null,null,"CUPOM",null,null,"JUROS",null,null,"Título de Renda Fixa "]
["Venc","2014-12-01",null,"Spot",{"$f":"(E4-E3)/1000","v":2.246},null,"C. Curto",{"$f":"C27","v":0.33539756640399432},null,"DI-Curto",{"$f":"C35","v":10.93},null,"COTAÇÂO",{"$f":"100/(1+N3/100)^((N4)/360)","v":99.309378116955799}]
[null,null,null,"Casado",8,null,"FRA",{"$f":"Cubic_Spline(E36:E50,F36:F50,B6)","v":1.1499999761581421},null,"DI-Longo",{"$f":"Cubic_Spline(B35:B50,C35:C50,B5)","v":11.100000381469727},null,"TIR",{"$f":"((1+H4*B4/36000)^(360/N4)-1)*100","v":1.11499862727098}]
["DC",{"$f":"B2-$B$1","v":229},null,"1º Futuro",2254,null,"LINEAR",{"$f":"(F29-1)*36000/B4","v":1.0932439720444911},null,"Prêmio",100,null,"Dias 30/360",{"$f":"DAYS360($B$1,B2)","v":225}]
["DU",159,null,"US$ VENC",{"$f":"(1+K3/100)^(B5/252)*E2/F27","v":2.3836550648485817},null,null,null,null,"Taxa pré",{"$f":"((((((1+K3/100)^(1/252)-1)*K4/100)+1)^252)-1)*100","v":11.100000381468389}]
["DC FRA",{"$f":"B4-E35","v":213}]
[null,null,null,"Var. Cambial",{"$f":"(E5/$E$2-1)*36000/B4","v":9.6349499246577892}]
[]
["PRÉ",null,null,null,null,"DU"]
[null,null,null,null,null,{"$f":"B5","v":159}]
{"$rows_left_out":40}