{"text_format":"1","workbook":"xlsx","n_sheets":9,"sheets":["modSpline","NTN-B","Ex_NTN-B","BALANCEAMENTO","Ex+NTN-B_2","BMF","ANBIMA","FERIADOS","DAP"],"not_rendered":{"charts":2,"images":0,"macros":1,"external_links":1,"defined_names":4,"comments":0,"pivot_tables":0},"unopened":[{"sheet":"modSpline","index":0,"reason":"part_missing"}],"bounds":{"document_bytes":16777216,"sheet_cells":100000,"rows_first":2000,"rows_last":500,"rows_between":2000,"halvings":0,"cell_chars":16384,"cell_head_chars":4096},"cells_cut":0,"cells_raw":0,"read":"whole","date_system":"1900"}

{"sheet":"NTN-B","index":1,"n_rows":586,"n_cols":22,"rows_kept":586,"cut":false,"hidden":false,"merged":[[1,3,1,4]]}
["IV","Calculo FLUXO E PU NTN-B"]
[null,null,null,"NTN-B"]
[null,null,null,null,null,null,null,null,"DT. LIQ.","DU","VR. FUTURO","VR. PRESENTE","PU","Fin","VP * Prazo"]
[null,null,null,"LIQUIDAÇÃO",{"$f":"BMF!L1","v":"2020-02-05"},null,null,null,"2020-02-17",{"$f":"NETWORKDAYS($E$4,I4,Feriado)-1","v":8},{"$f":"$E$6","v":2.9563009999999998},{"$f":"K4/(1+$E$9/100)^(J4/252)","v":2.9542349645550976},{"$f":"L4*$E$8/100","v":97.546480508392008},{"$f":"M4*$E$11","v":9754.6480508392015},{"$f":"L4*J4","v":23.633879716440781}]
[null,null,null,"JUROS",6,null,null,null,"2020-08-17",132,2.9563009999999998,2.9223954273298358,{"$f":"L5*$E$8/100","v":96.49516440300296},{"$f":"M5*$E$11","v":9649.5164403002964},385.75619640753831]
[null,null,null,"CUPOM DE JUROS",{"$f":"ROUND((1+E5/100)^(1/2)-1,8)*100","v":2.9563009999999998},null,null,null,"2021-02-17",257,2.9563009999999998,2.8906464252842916,95.446837696984517,9544.6837696984512,742.89613129806298]
[null,null,null,"VN",1000,null,null,null,"2021-08-16",382,2.9563009999999998,2.8592423454629814,94.409900047499093,9440.9900047499086,1092.2305759668589]
[null,null,null,"VNA (05/02)",{"$f":"E12*E17","v":3301.9201816630834},null,null,null,"2022-02-15",509,2.9563009999999998,2.8276851869124977,93.367907860561246,9336.7907860561245,1439.2917601384613]
[null,null,null,"TAXA",{"$f":"ANBIMA!F11","v":2.2265999999999999},null,null,null,"2022-08-15",633,2.9563009999999998,2.7972095514771893,92.361626703632737,9236.1626703632737,1770.6336460850607]
[null,null,null,"VENCIMENTO","2024-08-15",null,null,null,"2023-02-15",761,2.9563009999999998,2.7660953087674818,91.334259244229273,9133.425924422927,2104.9985299720538]
[null,null,null,"estoque",100,null,null,null,"2023-08-15",884,2.9563009999999998,2.7365225921793135,90.357791746938517,9035.779174693851,2419.0859714865132]
[null,null,null,"VNA (15/01)",3297.2007654449317,null,null,null,"2024-02-15",1008,{"$f":"$E$6","v":2.9563009999999998},2.7070294699372295,89.383952391424572,8938.3952391424573,2728.6857056967274]
[null,null,null,null,null,null,null,null,"2024-08-15",1135,{"$f":"$E$6+100","v":102.956301},93.234651960810424,3078.5337893973351,307853.37893973349,105821.32997551984]
[null,null,null,"PROJ IPCA DO MÊS (%)",0.21,null,null,null,null,null,"COTAÇÃO",{"$f":"SUM(L4:L13)","v":118.69571323271634},{"$f":"SUM(M4:M13)","v":3919.2377100000003},{"$f":"SUM(N4:N13)","v":391923.77099999995},{"$f":"SUM(O4:O13)","v":118528.54237228756}]
[null,null,null,"DU MÊS",{"$f":"NETWORKDAYS(F16,G16,Feriado)-1","v":22},"DU I","DU F",null,null,null,"PU",{"$f":"L14*E8/100","v":3919.2377099999999}]
{"$rows_left_out":572}
{"sheet":"Ex_NTN-B","index":2,"n_rows":60,"n_cols":13,"rows_kept":60,"cut":false,"hidden":false,"merged":[[42,7,42,12],[42,1,42,5]]}
["IV","Calculo FLUXO E PU NTN-B"]
[null,"NTN-B"]
[null,null,null,null,null,"DT. LIQ.","DU","VR. FUTURO","VR. PRESENTE","PU","Fin","VP * Prazo"]
[null,"LIQUIDAÇÃO","2020-02-05",null,null,"2020-02-17",{"$f":"NETWORKDAYS($C$4,F4,Feriado)-1","v":8},{"$f":"$C$6","v":2.9563009999999998},{"$f":"H4/(1+$C$9/100)^(G4/252)","v":2.9542349645550976},{"$f":"I4*$C$8/100","v":97.546480508392008},{"$f":"J4*$C$11","v":487732.40254196007},{"$f":"I4*G4","v":23.633879716440781}]
[null,"JUROS",6,null,null,"2020-08-17",132,2.9563009999999998,2.9223954273298358,96.49516440300296,482475.82201501483,385.75619640753831]
[null,"CUPOM DE JUROS",{"$f":"ROUND((1+C5/100)^(1/2)-1,8)*100","v":2.9563009999999998},null,null,"2021-02-17",257,2.9563009999999998,2.8906464252842916,95.446837696984517,477234.18848492258,742.89613129806298]
[null,"VN",1000,null,null,"2021-08-16",382,2.9563009999999998,2.8592423454629814,94.409900047499093,472049.50023749546,1092.2305759668589]
[null,"VNA (05/02)",{"$f":"C12*C17","v":3301.9201816630834},null,null,"2022-02-15",509,2.9563009999999998,2.8276851869124977,93.367907860561246,466839.53930280625,1439.2917601384613]
[null,"TAXA",{"$f":"'NTN-B'!$E$9","v":2.2265999999999999},null,null,"2022-08-15",633,2.9563009999999998,2.7972095514771893,92.361626703632737,461808.1335181637,1770.6336460850607]
[null,"VENCIMENTO","2024-08-15",null,null,"2023-02-15",761,2.9563009999999998,2.7660953087674818,91.334259244229273,456671.29622114636,2104.9985299720538]
[null,"estoque",5000,null,null,"2023-08-15",884,2.9563009999999998,2.7365225921793135,90.357791746938517,451788.9587346926,2419.0859714865132]
[null,"VNA (15/01)",{"$f":"'NTN-B'!$E$12","v":3297.2007654449317},null,null,"2024-02-15",1008,2.9563009999999998,2.7070294699372295,89.383952391424572,446919.76195712289,2728.6857056967274]
[null,null,null,null,null,"2024-08-15",1135,{"$f":"$C$6+100","v":102.956301},93.234651960810424,3078.5337893973351,15392668.946986675,105821.32997551984]
[null,"PROJ IPCA DO MÊS (%)",{"$f":"'NTN-B'!$E$14","v":0.21},null,null,null,null,"COTAÇÃO",{"$f":"SUM(I4:I13)","v":118.69571323271634},{"$f":"SUM(J4:J13)","v":3919.2377100000003},{"$f":"SUM(K4:K13)","v":19596188.550000001},{"$f":"SUM(L4:L13)","v":118528.54237228756}]
[null,"DU MÊS",{"$f":"NETWORKDAYS(D16,E16,Feriado)-1","v":22},"DU I","DU F",null,null,"PU",{"$f":"I14*C8/100","v":3919.2377099999999}]
{"$rows_left_out":46}
{"sheet":"BALANCEAMENTO","index":3,"n_rows":32,"n_cols":15,"rows_kept":32,"cut":false,"hidden":false,"merged":[[3,5,3,6],[3,11,3,14],[13,11,13,14]]}
[]
[]
[null,"BM&F"]
[null,null,null,null,null,"Ativo Renda Fixa ",null,null,null,null,null,"Balanceamento dinâmico"]
["DU-1","DU","BMF","pu"]
[0,{"$f":"BMF!B5","v":16},{"$f":"BMF!C5","v":4.2},{"$f":"100000/(1+C6/100)^(B6/252)","v":99739.122191319417},null,null,null,null,"VN",null,null,null,null,"PU","DU"]
[{"$f":"B6","v":16},{"$f":"BMF!B6","v":38},{"$f":"BMF!C6","v":4.18},{"$f":"100000/(1+C7/100)^(B7/252)","v":99384.402817905429},null,null,null,null,{"$f":"G15*(1+G10/100)^(I13/252)","v":128.5014829608017},null,null,"Contrato longo",null,{"$f":"VLOOKUP(O7,B6:D31,3)","v":78744.177375276486},{"$f":"VLOOKUP(I13,A6:C31,2)","v":1037}]
[{"$f":"B7","v":38},{"$f":"BMF!B7","v":58},{"$f":"BMF!C7","v":4.1500000000000004},99068.494635356386]
[58,{"$f":"BMF!B8","v":78},{"$f":"BMF!C8","v":4.16},98746.367361264944,null,null,null,null,null,null,null,"Quantidade = Fin/PU * (DU ATIVO/DU FUTURO)"]
[78,{"$f":"BMF!B9","v":99},{"$f":"BMF!C9","v":4.1550000000000002},98413.400262844574,null,"Taxa",{"$f":"Cubic_Spline(ANBIMA!L6:L20,ANBIMA!F6:F20,I13)","v":2.0233253526278272},"%a.a."]
[99,{"$f":"BMF!B10","v":122},{"$f":"BMF!C10","v":4.1550000000000002},98048.414496420824,null,null,null,null,null,null,null,"Qtde",{"$f":"G19/N7*I13/O7","v":4.7928331185491064}]
[122,{"$f":"BMF!B11","v":143},{"$f":"BMF!C11","v":4.1500000000000004},97719.010936304039,null,null,null,null,"Prazo"]
[143,{"$f":"BMF!B12","v":164},{"$f":"BMF!C12","v":4.21},97351.955339255292,null,null,null,null,{"$f":"'NTN-B'!L17","v":998.59160153407538}]
[164,{"$f":"BMF!B13","v":185},{"$f":"BMF!C13","v":4.22},97011.146225175136,null,null,null,null,null,null,null,"Balanceamento estático"]
[185,{"$f":"BMF!B14","v":205},{"$f":"BMF!C14","v":4.25},96670.789553646158,null,"cotação",{"$f":"'NTN-B'!L14","v":118.69571323271634}]
{"$rows_left_out":18}
{"sheet":"Ex+NTN-B_2","index":4,"n_rows":68,"n_cols":14,"rows_kept":68,"cut":false,"hidden":false,"merged":[[1,1,1,4],[1,6,1,10],[24,1,24,4],[24,6,24,10],[48,6,48,10],[48,0,48,5]]}
[1,"VNA",{"$f":"'NTN-B'!E8","v":3301.9201816630834},"VNA2",{"$f":"C1*A1","v":3301.9201816630834}]
[null,"Carteira Ativa A",null,null,null,null,"Carteira Passiva B"]
["DU","Taxa","QTDE","VF","VPL","fin","VF","VPL","Qtde","fin","Taxa","DU",null,"Ajuste DI"]
[null,null,100,null,{"$f":"SUM(E5:E16)","v":3867.5302411645594},{"$f":"SUM(F5:F16)","v":386753.02411645593},null,null,null,{"$f":"SUM(J5:J16)","v":387863.33092155016},null,null,null,1.0028708419478576]
[{"$f":"'NTN-B'!J4","v":8},2.57,{"$f":"C4","v":100},2.9563009999999998,{"$f":"D5/((1+$B5/100)^($A5/252))*$C$1/100","v":97.536096001373878},{"$f":"E5*C5","v":9753.609600137388},{"$f":"100000","v":100000},{"$f":"G5/((1+K5/100)^(L5/252))","v":99739.122191319417},{"$f":"F5/H5*$N$4","v":9.8071954683513457E-2},{"$f":"I5*H5","v":9781.6106717204893},{"$f":"VLOOKUP(L5,BALANCEAMENTO!$B$6:$C$31,2)","v":4.2},{"$f":"VLOOKUP(A28,BALANCEAMENTO!$A$6:$C$31,2)","v":16}]
[{"$f":"'NTN-B'!J5","v":132},{"$f":"B5","v":2.57},{"$f":"C5","v":100},2.9563009999999998,{"$f":"D6/((1+$B6/100)^($A6/252))*$C$1/100","v":96.32580648751626},{"$f":"E6*C6","v":9632.5806487516256},{"$f":"100000","v":100000},97719.010936304039,{"$f":"F6/H6*$N$4","v":9.8857266081428016E-2},{"$f":"I6*H6","v":9660.2342653441829},{"$f":"VLOOKUP(L6,BALANCEAMENTO!$B$6:$C$31,2)","v":4.1500000000000004},{"$f":"VLOOKUP(A29,BALANCEAMENTO!$A$6:$C$31,2)","v":143}]
[{"$f":"'NTN-B'!J6","v":257},{"$f":"B6","v":2.57},100,2.9563009999999998,95.120956261012594,9512.0956261012598,100000,95145.959331795515,0.10026073010594852,9539.4033492367034,{"$f":"VLOOKUP(L7,BALANCEAMENTO!$B$6:$C$31,2)","v":4.45},{"$f":"VLOOKUP(A30,BALANCEAMENTO!$A$6:$C$31,2)","v":288}]
[{"$f":"'NTN-B'!J7","v":382},2.57,100,2.9563009999999998,93.931176389185836,9393.1176389185839,100000,92613.284548233423,0.10171417460258123,9420.0837950575515,{"$f":"VLOOKUP(L8,BALANCEAMENTO!$B$6:$C$31,2)","v":4.7699999999999996},{"$f":"VLOOKUP(A31,BALANCEAMENTO!$A$6:$C$31,2)","v":415}]
[{"$f":"'NTN-B'!J8","v":509},2.57,100,2.9563009999999998,92.737599942490576,9273.7599942490579,100000,89944.40333672626,0.10340146966828966,9300.3834934549104,{"$f":"VLOOKUP(L9,BALANCEAMENTO!$B$6:$C$31,2)","v":5.07},{"$f":"VLOOKUP(A32,BALANCEAMENTO!$A$6:$C$31,2)","v":540}]
[{"$f":"'NTN-B'!J9","v":633},2.57,100,2.9563009999999998,91.586853199980609,9158.6853199980615,100000,87180.169561779563,0.1053562811837969,9184.9784580019405,{"$f":"VLOOKUP(L10,BALANCEAMENTO!$B$6:$C$31,2)","v":5.32},{"$f":"VLOOKUP(A33,BALANCEAMENTO!$A$6:$C$31,2)","v":667}]
[{"$f":"'NTN-B'!J10","v":761},2.57,100,2.9563009999999998,90.413961141162687,9041.396114116269,100000,84436.994396829425,0.10738601720868864,9067.3525333478701,{"$f":"VLOOKUP(L11,BALANCEAMENTO!$B$6:$C$31,2)","v":5.53},{"$f":"VLOOKUP(A34,BALANCEAMENTO!$A$6:$C$31,2)","v":792}]
[{"$f":"'NTN-B'!J11","v":884},2.57,100,2.9563009999999998,89.30103935162164,8930.1039351621639,100000,81619.862436540643,0.10972501771981097,8955.7408521379566,{"$f":"VLOOKUP(L12,BALANCEAMENTO!$B$6:$C$31,2)","v":5.74},{"$f":"VLOOKUP(A35,BALANCEAMENTO!$A$6:$C$31,2)","v":917}]
[{"$f":"'NTN-B'!J12","v":1008},2.57,100,2.9563009999999998,88.192935624542699,8819.2935624542697,100000,78744.177375276486,0.1123208426981523,8844.6123603638334,{"$f":"VLOOKUP(L13,BALANCEAMENTO!$B$6:$C$31,2)","v":5.9790000000000001},{"$f":"VLOOKUP(A36,BALANCEAMENTO!$A$6:$C$31,2)","v":1037}]
[{"$f":"'NTN-B'!J13","v":1135},{"$f":"B13","v":2.57},{"$f":"C13","v":100},102.956301,3032.3838167656727,{"$f":"E14*C14","v":303238.38167656725},100000,{"$f":"G14/((1+K14/100)^(L14/252))","v":75972.341174031375},4.0028900839880173,304108.93114288477,{"$f":"VLOOKUP(L14,BALANCEAMENTO!$B$6:$C$31,2)","v":6.1189999999999998},{"$f":"VLOOKUP(A37,BALANCEAMENTO!$A$6:$C$31,2)","v":1166}]
[]
{"$rows_left_out":54}
{"sheet":"BMF","index":5,"n_rows":30,"n_cols":12,"rows_kept":30,"cut":false,"hidden":false,"merged":[]}
["TAXA DE JUROS",null,null,null,null,null,null,null,null,null,null,"2020-02-05"]
["BMF Bovespa - Taxa de Juros"]
["DI1 - Depósito Interfinanceiro de um dia"]
["Dvc","DU","Ultima","Var","Neg","Cng","Cab","Mín","Máx","Abe","Ajut","Ajat"]
["2020-03-02",16,4.2,-0.23752999999999999,72,627035,1595378,4.1849999999999996,4.2030000000000003,4.1849999999999996,4.1970000000000001,4.1980000000000004]
["2020-04-01",38,4.18,-0.11947000000000001,1627,634495,5521510,4.1660000000000004,4.1849999999999996,4.173,4.17,4.1740000000000004]
["2020-05-04",58,4.1500000000000004,-0.24038999999999999,37,26295,218825,4.1470000000000002,4.1500000000000004,4.1500000000000004,4.1500000000000004,4.1509999999999998]
["2020-06-01",78,4.16,-0.12005,3,270,125280,4.16,4.18,4.16,4.1429999999999998,4.1470000000000002]
["2020-07-01",99,4.1550000000000002,0,1413,364175,5266707,4.13,4.16,4.1449999999999996,4.1399999999999997,4.1420000000000003]
["2020-08-03",122,4.1550000000000002,0.24126,1,200,72720,4.1550000000000002,4.1550000000000002,4.1550000000000002,4.1429999999999998,4.1479999999999997]
["2020-09-01",143,4.1500000000000004,0.12063,6,550,37370,4.1500000000000004,4.1500000000000004,4.1500000000000004,4.1449999999999996,4.1429999999999998]
["2020-10-01",164,4.21,0.11891,458,66570,695068,4.1849999999999996,4.21,4.1950000000000003,4.1849999999999996,4.194]
["2020-11-03",185,4.22,-0.23641000000000001,6,685,37945,4.21,4.22,4.21,4.21,4.2190000000000003]
["2020-12-01",205,4.25,0.33050000000000002,35,5075,37095,4.24,4.25,4.24,4.2279999999999998,4.2350000000000003]
["2021-01-04",227,4.32,0.34843000000000002,2752,430415,4303082,4.2750000000000004,4.3250000000000002,4.2850000000000001,4.29,4.2949999999999999]
{"$rows_left_out":16}
{"sheet":"ANBIMA","index":6,"n_rows":40,"n_cols":13,"rows_kept":40,"cut":false,"hidden":false,"merged":[[26,0,26,1],[26,2,26,10],[27,0,28,0],[27,1,28,1],[27,2,28,2],[27,3,28,3],[27,4,28,4],[27,5,28,5],[27,6,28,6],[27,7,27,10],[3,4,4,4],[2,2,2,10],[3,7,3,10],[3,5,4,5],[3,6,4,6],[2,0,2,1],[3,0,4,0],[3,1,4,1],[3,2,4,2],[3,3,4,3]]}
["Títulos Públicos Federais",null,null,null,null,null,null,null,null,null,"05/Fev/2020"]
[]
["Papel IPCA",null,"NTN-B - Taxa (% a.a.)/252"]
["Código SELIC","Data Base/Emissão","Data de Vencimento","Tx. Compra","Tx. Venda","Tx. Indicativas","PU","Intervalo Indicativo"]
[null,null,null,null,null,null,null,"Mínimo (D0)","Máximo (D0)","Mínimo (D+1)","Máximo (D+1)"]
[760199,"2000-07-15","2020-08-15",1.3593999999999999,1.3372999999999999,1.3478000000000001,3473.3496610000002,1.1097999999999999,1.9330000000000001,1.0267999999999999,1.8566,{"$f":"NETWORKDAYS($K$1,C6,Feriado)-1","v":131}]
[760199,"2000-07-15","2021-05-15",1.0722,1.0510999999999999,1.06,3548.7655260000001,0.85370000000000001,1.2316,0.86850000000000005,1.2464999999999999,317]
[760199,"2000-07-15","2022-08-15",1.6980999999999999,1.675,1.6845000000000001,3739.6825720000002,1.4334,1.899,1.4306000000000001,1.8963000000000001,633]
[760100,"2000-07-15","2023-03-15",1.88,1.8633,1.8717999999999999,3781.428754,1.6384000000000001,2.1044999999999998,1.6269,2.093,779]
[760199,"2000-07-15","2023-05-15",1.8816999999999999,1.8608,1.8716999999999999,3770.2550550000001,1.6423000000000001,2.1114000000000002,1.6303000000000001,2.0994000000000002,819]
[760199,"2000-07-15","2024-08-15",2.2370999999999999,2.2147000000000001,2.2265999999999999,3919.2377099999999,2.0104000000000002,2.4914999999999998,1.9770000000000001,2.4582000000000002,1135,{"$f":"G11/'NTN-B'!L14*100","v":3301.9201816630834}]
[760199,"2000-07-15","2025-05-15",2.4451999999999998,2.4249999999999998,2.4369999999999998,3915.5890880000002,2.2339000000000002,2.6970000000000001,2.1909000000000001,2.6541999999999999,1322]
[760199,"2000-07-15","2026-08-15",2.5764999999999998,2.5547,2.5663999999999998,4059.6683910000002,2.3788,2.8046000000000002,2.3319000000000001,2.7578,1639]
[760199,"2000-07-15","2028-08-15",2.7721,2.7523,2.76,4188.5390479999996,2.5893999999999999,2.968,2.5466000000000002,2.9253,2141]
[760199,"2000-07-15","2030-08-15",2.9815999999999998,2.9567000000000001,2.97,4278.9126130000004,2.8237999999999999,3.1844999999999999,2.7745000000000002,3.1353,2641]
{"$rows_left_out":26}
{"sheet":"FERIADOS","index":7,"n_rows":62,"n_cols":12,"rows_kept":62,"cut":false,"hidden":false,"merged":[]}
["2009-01-01","2009-02-23","2009-02-24","2009-04-10","2009-04-21","2009-05-01","2009-06-11","2009-09-07","2009-10-12","2009-11-02","2009-11-15","2009-12-25"]
["2010-01-01","2010-02-15","2010-02-16","2010-04-02","2010-04-21","2010-05-01","2010-06-03","2010-09-07","2010-10-12","2010-11-02","2010-11-15","2010-12-25"]
["2011-01-01","2011-03-07","2011-03-08","2011-04-21","2011-04-22","2011-05-01","2011-06-23","2011-09-07","2011-10-12","2011-11-02","2011-11-15","2011-12-25"]
["2012-01-01","2012-02-20","2012-02-21","2012-04-06","2012-04-21","2012-05-01","2012-06-07","2012-09-07","2012-10-12","2012-11-02","2012-11-15","2012-12-25"]
["2013-01-01","2013-02-11","2013-02-12","2013-03-29","2013-04-21","2013-05-01","2013-05-30","2013-09-07","2013-10-12","2013-11-02","2013-11-15","2013-12-25"]
["2014-01-01","2014-03-03","2014-03-04","2014-04-18","2014-04-21","2014-05-01","2014-06-19","2014-09-07","2014-10-12","2014-11-02","2014-11-15","2014-12-25"]
["2015-01-01","2015-02-16","2015-02-17","2015-04-03","2015-04-21","2015-05-01","2015-06-04","2015-09-07","2015-10-12","2015-11-02","2015-11-15","2015-12-25"]
["2016-01-01","2016-02-08","2016-02-09","2016-03-25","2016-04-21","2016-05-01","2016-05-26","2016-09-07","2016-10-12","2016-11-02","2016-11-15","2016-12-25"]
["2017-01-01","2017-02-27","2017-02-28","2017-04-14","2017-04-21","2017-05-01","2017-06-15","2017-09-07","2017-10-12","2017-11-02","2017-11-15","2017-12-25"]
["2018-01-01","2018-02-12","2018-02-13","2018-03-30","2018-04-21","2018-05-01","2018-05-31","2018-09-07","2018-10-12","2018-11-02","2018-11-15","2018-12-25"]
["2019-01-01","2019-03-04","2019-03-05","2019-04-19","2019-04-21","2019-05-01","2019-06-20","2019-09-07","2019-10-12","2019-11-02","2019-11-15","2019-12-25"]
["2020-01-01","2020-02-24","2020-02-25","2020-04-10","2020-04-21","2020-05-01","2020-06-11","2020-09-07","2020-10-12","2020-11-02","2020-11-15","2020-12-25"]
["2021-01-01","2021-02-15","2021-02-16","2021-04-02","2021-04-21","2021-05-01","2021-06-03","2021-09-07","2021-10-12","2021-11-02","2021-11-15","2021-12-25"]
["2022-01-01","2022-02-28","2022-03-01","2022-04-15","2022-04-21","2022-05-01","2022-06-16","2022-09-07","2022-10-12","2022-11-02","2022-11-15","2022-12-25"]
["2023-01-01","2023-02-20","2023-02-21","2023-04-07","2023-04-21","2023-05-01","2023-06-08","2023-09-07","2023-10-12","2023-11-02","2023-11-15","2023-12-25"]
{"$rows_left_out":48}
{"sheet":"DAP","index":8,"n_rows":39,"n_cols":32,"rows_kept":39,"cut":false,"hidden":false,"merged":[]}
["VENCTO  ","CONTR. ABERT.(1)","CONTR. FECH.(2)","NÚM. NEGOC.","CONTR. NEGOC.","VOL.","AJUSTE ANTER. (3)","AJUSTE CORRIG. (4)","PREÇO ABERT.","PREÇO MÍN.","PREÇO MÁX.","PREÇO MÉD.","ÚLT. PREÇO","AJUSTE","VAR. PTOS.","Ajuste",null,null,"2020-02-05","cupom real","di 1dia",null,null,"inflação"]
["G20 ",10435,10435,0,0,0,99997.84,99997.84,0,0,0,0,0,99997.78,-0.06,{"$f":"O2*$F$22","v":-7.9970250000000007E-2},null,"2020-02-17",{"$f":"NETWORKDAYS($S$1,R2,[1]Planilha2!$A$1:$L$62)","v":9},1.79,4.2,{"$f":"(1+T2/100)^(S2/252)","v":1.0006338322681245},{"$f":"(1+U2/100)^(S2/252)","v":1.0014704351501218},{"$f":"((W2/V2)^(252/S2)-1)*100","v":2.3676196089991608},"ÍNDICE NACIONAL DE PREÇOS AO CONSUMIDOR AMPLO ESPECIAL  - IPCA15"]
["H20 ",0,0,0,0,0,99772.38,99772.38,0,0,0,0,0,99786.82,14.44,{"$f":"O3*$F$22","v":19.246173500000001},null,"2020-03-16",{"$f":"NETWORKDAYS($S$1,R3,[1]Planilha2!$A$1:$L$62)","v":27},{"$f":"((100000/N3)^(252/S3)-1)*100","v":2.011772590315597},{"$f":"VLOOKUP(S3,BMF!$B$5:$C$30,2)","v":4.2},{"$f":"(1+T3/100)^(S3/252)","v":1.0021363542800541},{"$f":"(1+U3/100)^(S3/252)","v":1.004417795168302},{"$f":"((W3/V3)^(252/S3)-1)*100","v":2.145073410764553},null,null,"                                  SÉRIE HISTÓRICA"]
["J20 ",0,0,0,0,0,99619.26,99619.26,0,0,0,0,0,99638.64,19.38,25.830390749999999,null,"2020-04-15",{"$f":"NETWORKDAYS($S$1,R4,[1]Planilha2!$A$1:$L$62)","v":48},1.9187519453695234,{"$f":"VLOOKUP(S4,BMF!$B$5:$C$30,2)","v":4.18},{"$f":"(1+T4/100)^(S4/252)","v":1.0036267054628607},{"$f":"(1+U4/100)^(S4/252)","v":1.0078304966220708},{"$f":"((W4/V4)^(252/S4)-1)*100","v":2.2186771437727737},null,null,null,null,null,null,null,"(conclusão)"]
["K20 ",0,0,0,0,0,99546.7,99546.7,0,0,0,0,0,99571.04,24.34,32.441264750000002,null,"2020-05-15",{"$f":"NETWORKDAYS($S$1,R5,[1]Planilha2!$A$1:$L$62)","v":68},1.6058520195609605,{"$f":"VLOOKUP(S5,BMF!$B$5:$C$30,2)","v":4.1500000000000004},1.0043080799397095,1.011032697019846,2.5039384345197924]
["Q20 ",104723,103848,16,10625,1406215598,99292.76,99292.76,1.36,1.35,1.37,1.35,1.37,99289.79,-2.97,-3.9585273750000005,null,"2020-08-17",{"$f":"NETWORKDAYS($S$1,R6,[1]Planilha2!$A$1:$L$62)","v":133},1.3596222380704015,{"$f":"VLOOKUP(S6,BMF!$B$5:$C$30,2)","v":4.1550000000000002},1.0071529006154611,1.0217183095547804,2.7578809985734809,"ANO","MÊS","NÚMERO ÍNDICE",null,null,"    VARIAÇÃO (%)"]
["F21 ",27407,27752,11,550,72586666,99044.05,99044.05,1.05,1.05,1.06,1.05,1.06,99017.39,-26.66,-35.533447750000001,null,"2021-01-15",{"$f":"NETWORKDAYS($S$1,R7,[1]Planilha2!$A$1:$L$62)","v":237},1.0554990410468257,{"$f":"VLOOKUP(S7,BMF!$B$5:$C$30,2)","v":4.32},1.0099236103880338,1.0405771144053377,3.2304040749204344,null,null,"(DEZ  93 = 100)"]
["K21 ",136562,134847,23,13100,1722745706,98664.9,98664.9,1.07,1.06,1.1100000000000001,1.06,1.1100000000000001,98616.66,-48.24,-64.296081000000015,null,"2021-05-17",{"$f":"NETWORKDAYS($S$1,R8,[1]Planilha2!$A$1:$L$62)","v":319},1.1065011475147823,{"$f":"VLOOKUP(S8,BMF!$B$5:$C$30,2)","v":4.45},1.0140274472893323,1.0566610266768757,3.3069078788583894,null,null,null,"NO MÊS","3 MESES","SEMESTRAL","NO ANO","  12 MESES"]
["F22 ",215,215,0,0,0,97285.48,97285.48,0,0,0,0,0,97269.29,-16.190000000000001,-21.578639125000002,null,"2022-01-17",{"$f":"NETWORKDAYS($S$1,R9,[1]Planilha2!$A$1:$L$62)","v":489},1.4370354311013189,{"$f":"VLOOKUP(S9,BMF!$B$5:$C$30,2)","v":4.92},1.0280737116514371,1.097678099600532,3.433622201295905]
["Q22 ",113590,116285,23,3185,407261975,95945.61,95945.61,1.67,1.65,1.67,1.66,1.67,95925.11,-20.5,-27.323168750000001,null,"2022-08-15",{"$f":"NETWORKDAYS($S$1,R10,[1]Planilha2!$A$1:$L$62)","v":634},1.6673446846996232,{"$f":"VLOOKUP(S10,BMF!$B$5:$C$30,2)","v":5.2},1.0424799095878026,1.1360273984897475,3.4747197600726087,2018,"JAN",4843.6000000000004,0.39,1.06,1.87,0.39,3.02]
["K23 ",57838,56958,10,1740,218251759,94092.28,94092.28,1.89,1.88,1.89,1.88,1.88,94126.29,34.01,45.329803375000004,null,"2023-05-15",{"$f":"NETWORKDAYS($S$1,R11,[1]Planilha2!$A$1:$L$62)","v":820},1.8776870650205391,{"$f":"VLOOKUP(S11,BMF!$B$5:$C$30,2)","v":5.53},1.0624024382560917,1.1914191068254756,3.5849978932565252,null,"FEV",4862.01,0.38,1.1200000000000001,1.91,0.77,2.86]
["Q24 ",84960,86053,13,1260,151848992,90259.96,90259.96,2.2599999999999998,2.2599999999999998,2.27,2.2599999999999998,2.2599999999999998,90424.36,164.4,219.11848500000002,null,"2024-08-15",{"$f":"NETWORKDAYS($S$1,R12,[1]Planilha2!$A$1:$L$62)","v":1136},2.2579879350766108,{"$f":"VLOOKUP(S12,BMF!$B$5:$C$30,2)","v":6.0670000000000002},1.1058966853622185,1.3041102326592535,3.724904177991184,null,"MAR",4866.87,0.1,0.87,1.89,0.87,2.8]
["K25 ",9285,9635,11,900,105399494,87754.36,87754.36,2.4900000000000002,2.4900000000000002,2.5,2.4900000000000002,2.5,87895.08,140.72,187.556893,null,"2025-05-15",{"$f":"NETWORKDAYS($S$1,R13,[1]Planilha2!$A$1:$L$62)","v":1323},2.4880938905300409,6.3,1.1377201090208919,1.378159993774893,3.7193648206020224,null,"ABR",4877.09,0.21,0.69,1.76,1.08,2.8]
["Q26 ",45097,44937,10,915,102671338,84021.97,84021.97,2.69,2.66,2.69,2.68,2.66,84294.9,272.93,363.77133887500003,null,"2026-08-17",{"$f":"NETWORKDAYS($S$1,R14,[1]Planilha2!$A$1:$L$62)","v":1641},2.6583585699584633,6.5,1.1863113901315501,1.506947218090638,3.7421613627531158,null,"MAI",4883.92,0.14000000000000001,0.45,1.58,1.23,2.7]
["Q28 ",45385,45535,13,1330,138176381,77592.98,77592.98,3,2.96,3,2.97,2.97,77984.7,391.72,522.09910550000006,null,"2028-08-15",{"$f":"NETWORKDAYS($S$1,R15,[1]Planilha2!$A$1:$L$62)","v":2142},2.9685923745965681,7,1.2823028106795298,1.777305604268717,3.9151818359692614,null,"JUN",4938.13,1.1100000000000001,1.46,2.35,2.35,3.68]
{"$rows_left_out":24}