{"text_format":"1","workbook":"xlsx","n_sheets":8,"sheets":["modSpline","LFT","BALANCEAMENTO","NTN-F","Ex2_F","Geral DUR","BMF","FERIADOS"],"not_rendered":{"charts":1,"images":2,"macros":1,"external_links":0,"defined_names":4,"comments":0,"pivot_tables":0},"unopened":[{"sheet":"modSpline","index":0,"reason":"part_missing"}],"bounds":{"document_bytes":16777216,"sheet_cells":100000,"rows_first":2000,"rows_last":500,"rows_between":2000,"halvings":0,"cell_chars":16384,"cell_head_chars":4096},"cells_cut":0,"cells_raw":0,"read":"whole","date_system":"1900"}

{"sheet":"LFT","index":1,"n_rows":75,"n_cols":20,"rows_kept":75,"cut":false,"hidden":false,"merged":[[41,4,42,4],[41,5,42,5],[41,6,42,6],[1,3,1,6],[40,0,40,1],[40,2,40,10],[41,0,42,0],[41,1,42,1],[41,2,42,2],[41,3,42,3],[61,0,61,1],[61,2,61,10],[62,0,63,0],[62,4,63,4],[62,5,63,5],[62,6,63,6],[62,1,63,1],[62,2,63,2],[62,3,63,3],[61,11,61,15],[7,13,7,14],[6,16,6,19],[62,7,62,10],[41,7,41,10]]}
["I","Calculo FLUXO E PU LFT"]
[null,null,null,"LFT"]
[null,null,null,{"$f":"K39","v":"05/Fev/2020"},{"$f":"C47","v":"2021-09-01"},{"$f":"C48","v":"2022-03-01"},{"$f":"C51","v":"2023-09-01"},null,"Endereço para encontar o VNA da LFT:"]
[null,null,null,"Taxa (%)",{"$f":"F47","v":6.0000000000000001E-3},{"$f":"F48","v":8.0999999999999996E-3},{"$f":"F51","v":1.43E-2},null,"http://www.bcb.gov.br/?SELICLFTLBC"]
[null,null,null,"Du",{"$f":"NETWORKDAYS($D$3,E3,Feriado)-1","v":394},{"$f":"NETWORKDAYS($D$3,F3,Feriado)-1","v":517},{"$f":"NETWORKDAYS($D$3,G3,Feriado)-1","v":897},null,null,null,null,null,null,"IV","LTN X LFT"]
[null,null,null,"Cotação",{"$f":"100/(1+E4/100)^(E5/252)","v":99.990619769007537},{"$f":"100/(1+F4/100)^(F5/252)","v":99.983384196421596},{"$f":"100/(1+G4/100)^(G5/252)","v":99.949115399218414}]
[null,null,null,"VNA",10514.922330003232,10514.922330003232,10514.922330003232,null,null,null,null,null,null,"BMF","SELIC",null,"LTN"]
[null,null,null,"PU",{"$f":"E6/100*E7","v":10513.936006},{"$f":"F6/100*F7","v":10513.175191162458},{"$f":"G6/100*G7","v":10509.571853753116},null,null,null,null,null,null,"TAXA",null,null,"DU","TAXA","BP","LTN PÓS"]
[null,null,null,null,null,null,null,null,null,null,null,null,null,{"$f":"VLOOKUP(Q9,$L$65:$N$75,3,FALSE)","v":4.18},{"$f":"N9+$E$23/100","v":4.18},null,{"$f":"L65","v":38},{"$f":"O65","v":4.1749999999999998},{"$f":"(R9-N9)*100","v":-0.49999999999998934},{"$f":"((1+R9/100)/(1+O9/100)-1)*100","v":-4.7993856786443523E-3}]
[null,null,null,null,null,null,null,null,null,null,null,null,null,4.1550000000000002,4.1550000000000002,null,99,4.1494,-0.56000000000002714,-5.3766021794521279E-3]
["II","LFT SINTÉTICA",null,null,null,null,null,null,null,null,null,null,null,4.21,4.21,null,164,4.1931000000000003,-1.6899999999999693,-1.621725362249693E-2]
[null,null,null,"BMF",{"$f":"_xll.SRS1Splines.Functions25.Cubic_Spline($Q$9:$Q$19,$N$9:$N$19,E5)","v":4.7196088798639897},{"$f":"_xll.SRS1Splines.Functions25.Cubic_Spline($Q$9:$Q$19,$N$9:$N$19,F5)","v":5.0157427821517402},{"$f":"_xll.SRS1Splines.Functions25.Cubic_Spline($Q$9:$Q$19,$N$9:$N$19,G5)","v":5.7234695828293898},null,null,null,null,null,null,4.45,4.45,null,288,4.4318999999999997,-1.8100000000000449,-1.7328865485877198E-2]
[null,null,null,null,null,null,null,null,null,null,null,null,null,4.6100000000000003,4.6100000000000003,null,350,4.5833000000000004,-2.6699999999999946,-2.5523372526525812E-2]
[null,null,null,"LFT pre",{"$f":"(((1+(E12+E23/100))^(E5/252)*(100/E6))^(252/E5)-1)","v":4.7199520563967825},{"$f":"(((1+(F12+E23/100))^(F5/252)*(100/F6))^(252/F5)-1)","v":5.0162300573170944},{"$f":"(((1+(G12+E23/100))^(G5/252)*(100/G6))^(252/G5)-1)","v":5.7244310389797333},null,null,null,null,null,null,4.7699999999999996,4.7699999999999996,null,415,4.75,-1.9999999999999574,-1.9089433998276117E-2]
[null,null,null,null,null,null,null,null,null,null,null,null,null,4.92,4.92,null,478,4.9088000000000003,-1.1199999999999655,-1.0674799847487648E-2]
[null,null,null,"premio(BP)",{"$f":"(E14-E12)*100","v":3.4317653279281046E-2},{"$f":"(F14-F12)*100","v":4.8727516535418403E-2},{"$f":"(G14-G12)*100","v":9.6145615034348708E-2},null,null,null,null,null,null,5.07,5.07,null,540,5.0709,8.9999999999967883E-2,8.5657180926013154E-4]
[null,null,null,null,null,null,null,null,null,null,null,null,null,5.2,5.2,null,602,5.2050000000000001,0.49999999999998934,4.7528517110206892E-3]
[null,null,null,"LTN",{"$f":"_xll.SRS1Splines.Functions25.Cubic_Spline($Q$9:$Q$19,$R$9:$R$19,E5)","v":4.6963749921082503},{"$f":"_xll.SRS1Splines.Functions25.Cubic_Spline($Q$9:$Q$19,$R$9:$R$19,F5)","v":5.0125139057747896},{"$f":"_xll.SRS1Splines.Functions25.Cubic_Spline($Q$9:$Q$19,$R$9:$R$19,G5)","v":5.7418946865574103},null,null,null,null,null,null,5.66,5.66,null,853,5.6738,1.3799999999999812,1.3060760931282722E-2]
[null,null,null,"premio(BP)",{"$f":"(E18-E12)*100","v":-2.3233887755739424},{"$f":"(F18-F12)*100","v":-0.32288763769505735},{"$f":"(G18-G12)*100","v":1.8425103728020531},null,null,null,null,null,null,5.83,5.83,null,978,5.8590999999999998,2.9099999999999682,2.7496929037140738E-2]
[]
{"$rows_left_out":56}
{"sheet":"BALANCEAMENTO","index":2,"n_rows":32,"n_cols":15,"rows_kept":32,"cut":false,"hidden":false,"merged":[[3,5,3,6],[3,11,3,14],[13,11,13,14]]}
[]
[null,null,null,null,null,null,null,"Simulação",0]
[null,"BM&F"]
[null,null,null,null,null,"Ativo Renda Fixa ",null,null,null,null,null,"Balanceamento dinâmico"]
["DU-1","DU","BMF","pu"]
[0,{"$f":"BMF!M5","v":16},{"$f":"BMF!C5","v":4.2},{"$f":"100000/(1+C6/100)^(B6/252)","v":99739.122191319417},null,null,null,null,"VN",null,null,null,null,"PU","DU"]
[{"$f":"B6","v":16},{"$f":"BMF!M6","v":38},{"$f":"BMF!C6","v":4.18},{"$f":"100000/(1+C7/100)^(B7/252)","v":99384.402817905429},null,null,null,null,1000,null,null,"Contrato longo",null,{"$f":"VLOOKUP(O7,B6:D26,3)","v":87180.169561779563},{"$f":"VLOOKUP(I13,A6:C26,2)","v":667}]
[{"$f":"B7","v":38},{"$f":"BMF!M7","v":58},{"$f":"BMF!C7","v":4.1500000000000004},99068.494635356386,null,"BM&F",{"$f":"_xll.SRS1Splines.Functions25.Cubic_Spline(B6:B26,C6:C26,I13)","v":5.28768714073271}]
[58,{"$f":"BMF!M8","v":78},{"$f":"BMF!C8","v":4.16},98746.367361264944,null,"Prêmio",12,null,null,null,null,"Quantidade = Fin/PU * (DU ATIVO/DU FUTURO)"]
[78,{"$f":"BMF!M9","v":99},{"$f":"BMF!C9","v":4.1550000000000002},98413.400262844574,null,"Taxa",{"$f":"G8+G9/100","v":5.4076871407327101},"%a.a."]
[99,{"$f":"BMF!M10","v":122},{"$f":"BMF!C10","v":4.1550000000000002},98048.414496420824,null,null,null,null,null,null,null,"Qtde",{"$f":"G19/N7*I13/O7","v":97.582927378270156}]
[122,{"$f":"BMF!M11","v":143},{"$f":"BMF!C11","v":4.1500000000000004},97719.010936304039,null,null,null,null,"Prazo"]
[143,{"$f":"BMF!M12","v":164},{"$f":"BMF!C12","v":4.21},97351.955339255292,null,null,null,null,{"$f":"650-I2","v":650}]
[164,{"$f":"BMF!M13","v":185},{"$f":"BMF!C13","v":4.22},97011.146225175136,null,null,null,null,null,null,null,"Balanceamento estático"]
[185,{"$f":"BMF!M14","v":205},{"$f":"BMF!C14","v":4.25},96670.789553646158,null,"PU =",{"$f":"ROUND(I7/(1+G10/100)^(I13/252),6)","v":872.979467}]
[205,{"$f":"BMF!M15","v":227},{"$f":"BMF!C15","v":4.32},96261.938247204918,null,null,null,null,null,null,null,"PU int.",{"$f":"_xll.SRS1Splines.Functions25.Cubic_Spline(B6:B26,D6:D26,I13)","v":87555.294834460903},"Qdte teorica",{"$f":"G19/M16","v":99.706073590469359}]
[227,{"$f":"BMF!M16","v":288},{"$f":"BMF!C16","v":4.45},95145.959331795515,null,"Estoque",10000]
[288,{"$f":"BMF!M17","v":350},{"$f":"BMF!C17","v":4.6100000000000003},93932.308783316999,null,null,null,null,null,null,null,null,null,{"$f":"VLOOKUP(I13,A6:C26,1)","v":602}]
[350,{"$f":"BMF!M18","v":415},{"$f":"BMF!C18","v":4.7699999999999996},92613.284548233423,null,"Fin",{"$f":"G15*G17","v":8729794.6699999999},null,null,null,null,"DI curto",{"$f":"VLOOKUP(N18,B6:D26,3)","v":88594.516790592228}]
[415,{"$f":"BMF!M19","v":478},{"$f":"BMF!C19","v":4.92},91292.580077532577,null,null,null,null,null,null,null,null,null,null,{"$f":"VLOOKUP(I13,A6:C26,2)","v":667}]
{"$rows_left_out":13}
{"sheet":"NTN-F","index":3,"n_rows":115,"n_cols":16,"rows_kept":115,"cut":false,"hidden":false,"merged":[[101,11,101,15],[88,11,88,15],[0,4,0,5],[12,0,12,7],[46,0,46,3],[58,0,58,3],[101,0,101,1],[101,2,101,10],[88,0,88,1],[88,2,88,10],[89,0,90,0],[89,6,90,6],[89,7,89,10],[102,0,103,0],[102,1,103,1],[102,2,103,2],[89,1,90,1],[89,2,90,2],[89,3,90,3],[89,4,90,4],[89,5,90,5],[102,3,103,3],[102,4,103,4],[102,5,103,5],[102,6,103,6],[102,7,102,10]]}
["Etapas para estrutura de Hedge com NTN-F",null,null,null,"NTN-F"]
[1,"Precificação"]
[2,"Cálculo da Duration",null,null,"LIQUIDAÇÃO",{"$f":"BMF!L1","v":"2020-02-05"}]
[3,"Zero Cupom equivalente",null,null,"JUROS",10]
[4,"Balanceamento estático",null,null,"CUPOM DE JUROS",{"$f":"ROUND((1+F4/100)^(1/2)-1,8)*100","v":4.8808850000000001}]
[5,"Balanceamento dinâmico",null,null,"VALOR NOMINAL",1000]
[null,null,null,null,"PRÊMIO",{"$f":"F9-F8","v":-3.3000000000000362E-2}]
[null,null,null,null,"BM$F",{"$f":"VLOOKUP(F10,C92:P97,12,FALSE)","v":5.44}]
[null,null,null,null,"TAXA anbima",{"$f":"VLOOKUP(F10,C92:F97,4,FALSE)","v":5.407}]
[null,null,null,null,"VENCIMENTO","2023-01-01"]
[]
["I","Calculo FLUXO E PU NTN-F",null,null,null,null,null,null,null,null,"II","CÁLCULO DA DURATION"]
["FLUXO"]
["DT VENC.","DT. LIQ.","DU","VR. FUTURO","VR. PRESENTE","CV EQUIVALENTE","CURVA","BMF",null,null,"VP * Prazo"]
["2020-07-01","2020-07-01",{"$f":"IF(D15=0,0,NETWORKDAYS($F$3,B15,Feriado)-1)","v":99},{"$f":"IF(A15=$F$10,1048.80885,IF(AND(A15<$F$10,A15>$F$3),48.80885,0))","v":48.80885},{"$f":"D15/(1+$F$9/100)^(C15/252)","v":47.809493997550398},{"$f":"D15/(1+$F$25/100)^(C15/252)","v":47.815415116685713},{"$f":"IF(ISNA(H15),0,D15/(1+H15/100)^(C15/252))","v":48.034448914191415},{"$f":"VLOOKUP(C15,BMF!$B$5:$C$27,2,FALSE)","v":4.1550000000000002},null,null,{"$f":"E15*C15","v":4733.139905757489}]
["2021-01-01","2021-01-04",227,48.80885,{"$f":"D16/(1+$F$9/100)^(C16/252)","v":46.547666832212542},46.560886270507432,46.984345046170873,{"$f":"VLOOKUP(C16,BMF!$B$5:$C$27,2,FALSE)","v":4.32},null,null,10566.320370912246]
["2021-07-01","2021-07-01",350,48.80885,45.366517870678216,45.386384588846482,45.847279695586018,{"$f":"VLOOKUP(C17,BMF!$B$5:$C$27,2,FALSE)","v":4.6100000000000003},null,null,15878.281254737376]
["2022-01-01","2022-01-03",478,48.80885,44.169167724095608,44.195586003254355,44.558858471172762,{"$f":"VLOOKUP(C18,BMF!$B$5:$C$27,2,FALSE)","v":4.92},null,null,21112.862172117701]
["2022-07-01","2022-07-01",602,48.80885,43.039378666196946,43.071801695065091,43.241964808544978,{"$f":"VLOOKUP(C19,BMF!$B$5:$C$27,2,FALSE)","v":5.2},null,null,25909.705957050563]
["2023-01-01","2023-01-02",729,1048.8088499999999,900.61314788000607,901.43480649278354,899.79798355557489,{"$f":"VLOOKUP(C20,BMF!$B$5:$C$27,2,FALSE)","v":5.44},null,null,656546.98480452446]
{"$rows_left_out":96}
{"sheet":"Ex2_F","index":4,"n_rows":68,"n_cols":15,"rows_kept":68,"cut":false,"hidden":false,"merged":[[1,1,1,2],[43,1,43,5],[1,4,1,10]]}
[null,"Calculo FLUXO E PU NTN-F"]
[null,"NTN-F",null,null,"FLUXO"]
[null,null,null,null,"DT. LIQ.","DU","VR. FUTURO","VR. PRESENTE","Financeiro","FIN * DU","vp * ( t2 + t)"]
[null,"LIQUIDAÇÃO",{"$f":"'NTN-F'!F3","v":"2020-02-05"},null,{"$f":"'NTN-F'!B15","v":"2020-07-01"},{"$f":"'NTN-F'!C15","v":99},{"$f":"'NTN-F'!D15","v":48.80885},{"$f":"'NTN-F'!E15","v":47.809493997550398},{"$f":"H4*$C$12","v":956189.8799510079},{"$f":"I4*F4","v":94662798.115149781},{"$f":"((F4/252)^2+F4/252)*H4","v":26.161062404271835}]
[null,"JUROS",{"$f":"'NTN-F'!F4","v":10},null,{"$f":"'NTN-F'!B16","v":"2021-01-04"},{"$f":"'NTN-F'!C16","v":227},{"$f":"'NTN-F'!D16","v":48.80885},{"$f":"'NTN-F'!E16","v":46.547666832212542},{"$f":"H5*$C$12","v":930953.33664425078},{"$f":"I5*F5","v":211326407.41824493},{"$f":"((F5/252)^2+F5/252)*H5","v":79.699978862228619}]
[null,"CUPOM DE JUROS",{"$f":"'NTN-F'!F5","v":4.8808850000000001},null,{"$f":"'NTN-F'!B17","v":"2021-07-01"},{"$f":"'NTN-F'!C17","v":350},{"$f":"'NTN-F'!D17","v":48.80885},{"$f":"'NTN-F'!E17","v":45.366517870678216},907330.35741356434,317565625.09474754,150.52162565117001]
[null,"VALOR NOMINAL",{"$f":"'NTN-F'!F6","v":1000},null,{"$f":"'NTN-F'!B18","v":"2022-01-03"},{"$f":"'NTN-F'!C18","v":478},{"$f":"'NTN-F'!D18","v":48.80885},{"$f":"'NTN-F'!E18","v":44.169167724095608},883383.35448191222,422257243.44235402,242.69950531692368]
[null,"PRÊMIO",{"$f":"'NTN-F'!F7","v":-3.3000000000000362E-2},null,{"$f":"'NTN-F'!B19","v":"2022-07-01"},{"$f":"'NTN-F'!C19","v":602},{"$f":"'NTN-F'!D19","v":48.80885},{"$f":"'NTN-F'!E19","v":43.039378666196946},860787.57332393888,518194119.14101118,348.43299457232899]
[null,"BM$F",{"$f":"'NTN-F'!F8","v":5.44},null,{"$f":"'NTN-F'!B20","v":"2023-01-02"},{"$f":"'NTN-F'!C20","v":729},{"$f":"'NTN-F'!D20","v":1048.8088499999999},{"$f":"'NTN-F'!E20","v":900.61314788000607},18012262.95760012,13130939696.090488,10142.236584990527]
[null,"TAXA anbima",{"$f":"'NTN-F'!F9","v":5.407},null,{"$f":"'NTN-F'!B21","v":"00:00:00"},{"$f":"'NTN-F'!C21","v":0},{"$f":"'NTN-F'!D21","v":0},{"$f":"'NTN-F'!E21","v":0},0,0,0]
[null,"VENCIMENTO",{"$f":"'NTN-F'!F10","v":"2023-01-01"},null,{"$f":"'NTN-F'!B22","v":"00:00:00"},{"$f":"'NTN-F'!C22","v":0},{"$f":"'NTN-F'!D22","v":0},{"$f":"'NTN-F'!E22","v":0},0,0,0]
[null,"Carteira",20000,null,{"$f":"'NTN-F'!B23","v":"00:00:00"},{"$f":"'NTN-F'!C23","v":0},{"$f":"'NTN-F'!D23","v":0},{"$f":"'NTN-F'!E23","v":0},0,0,0]
[null,null,null,null,null,null,"PU",{"$f":"SUM(H4:H12)","v":1127.5453729707397},{"$f":"SUM(I4:I12)","v":22550907.459414795},{"$f":"SUM(J4:J12)","v":14694945889.301996},{"$f":"SUM(K4:K12)","v":10989.75175179745}]
[null,"Duration",{"$f":"J13/I13","v":651.63434845132997}]
[null,"Mod Duration",{"$f":"C14/(1+C9/100)","v":618.01436689238426}]
[null,"Convexity",{"$f":"(1/(1+C9/100)^2)*K13/H13","v":8.7668395985121261}]
[]
[]
[]
[null,"Calculo FLUXO E PU BMF"]
{"$rows_left_out":49}
{"sheet":"Geral DUR","index":5,"n_rows":68,"n_cols":14,"rows_kept":68,"cut":false,"hidden":false,"merged":[[1,1,1,4],[1,6,1,10],[24,1,24,4],[24,6,24,10],[48,1,48,4],[48,6,48,10]]}
[{"$f":"BMF!L1","v":"2020-02-05"}]
[null,"Carteira Ativa A",null,null,null,null,"Carteira Passiva B",null,null,null,null,null,"Atingir meta 0"]
["DU","Taxa","QTDE","VF","VPL",null,"VF","VPL","Qtde",null,"Taxa","Qtde teórica",{"$f":"F4-J4","v":0},"Ajuste DI"]
[null,null,null,null,null,{"$f":"SUM(F5:F16)","v":72054449.812586069},null,null,null,{"$f":"SUM(J5:J16)","v":72054449.812586069},null,null,null,1]
[38,4.1749999999999998,100,1000,{"$f":"D5/((1+$B5/100)^($A5/252))","v":993.85122099476177},{"$f":"E5*D5","v":993851.2209947618},100000,{"$f":"G5/((1+$K5/100)^($A5/252))","v":99384.402817905429},{"$f":"F5/H5*$N$4","v":10.000072373687455},{"$f":"I5*H5","v":993851.2209947618},{"$f":"VLOOKUP(A5,BMF!$B$5:$C$27,2,FALSE)","v":4.18},1]
[99,4.1494,100,1000,{"$f":"D6/((1+$B6/100)^($A6/252))","v":984.15479064514682},{"$f":"E6*D6","v":984154.79064514686},100000,{"$f":"G6/((1+$K6/100)^($A6/252))","v":98413.400262844574},{"$f":"F6/H6*$N$4","v":10.000211231566491},{"$f":"I6*H6","v":984154.79064514698},{"$f":"VLOOKUP(A6,BMF!$B$5:$C$27,2,FALSE)","v":4.1550000000000002},1]
[164,4.1931000000000003,100,1000,973.62231323565811,973622.3132356581,100000,97351.955339255292,10.001055549862837,973622.31323565822,{"$f":"VLOOKUP(A7,BMF!$B$5:$C$27,2,FALSE)","v":4.21},1]
[288,4.4318999999999997,300,1000,951.64805934171159,951648.05934171157,100000,95145.959331795515,10.001980809538104,951648.05934171157,{"$f":"VLOOKUP(A8,BMF!$B$5:$C$27,2,FALSE)","v":4.45},1]
[350,4.5833000000000004,400,1000,939.65617122464846,939656.17122464848,100000,93932.308783316999,10.003545993873598,939656.17122464848,{"$f":"VLOOKUP(A9,BMF!$B$5:$C$27,2,FALSE)","v":4.6100000000000003},1]
[415,4.75,100,1000,926.42406710860905,926424.06710860902,100000,92613.284548233423,10.003144490854583,926424.06710860902,{"$f":"VLOOKUP(A10,BMF!$B$5:$C$27,2,FALSE)","v":4.7699999999999996},1]
[478,4.9088000000000003,100,1000,913.1106806892758,913110.68068927585,100000,91292.580077532577,10.002025136257439,913110.68068927596,{"$f":"VLOOKUP(A11,BMF!$B$5:$C$27,2,FALSE)","v":4.92},1]
[540,5.0709,300,5000,4497.1376209756681,22485688.10487834,100000,89944.40333672626,249.99541128421654,22485688.10487834,{"$f":"VLOOKUP(A12,BMF!$B$5:$C$27,2,FALSE)","v":5.07},1]
[602,5.2050000000000001,200,5000,4429.2229274253887,22146114.637126945,100000,88594.516790592228,249.97161719921047,22146114.637126945,{"$f":"VLOOKUP(A13,BMF!$B$5:$C$27,2,FALSE)","v":5.2},1]
[853,5.6738,100,5000,4148.0359534681938,20740179.767340969,100000,82997.401416453489,249.88950754341829,20740179.767340969,{"$f":"VLOOKUP(A14,BMF!$B$5:$C$27,2,FALSE)","v":5.66},1]
[]
[]
["Duration",null,null,null,{"$f":"SUMPRODUCT(A5:A16,F5:F16)/F4","v":622.92287250477796},null,null,{"$f":"SUMPRODUCT($A$5:$A$16,J5:J16)/J4","v":622.92287250477796}]
["Modify Duration",null,"tx 0 equiv.",{"$f":"_xll.SRS1Splines.Functions25.Cubic_Spline(A5:A14,B5:B14,E17)","v":5.2465960994331873},{"$f":"-E17/(1+D18/100)","v":-591.86985193921419},null,{"$f":"cubic_Spline(A5:A14,K5:K14,H17)","v":5.2409856800821553},{"$f":"-H17/(1+G18/100)","v":-591.90140464702233}]
[]
["Valor de B para imunizar A",null,null,"Ft. Ajuste:",{"$f":"E18/H18","v":0.99994669262894054},null,{"$f":"F4*E20","v":72050608.779293418}]
{"$rows_left_out":49}
{"sheet":"BMF","index":6,"n_rows":27,"n_cols":13,"rows_kept":27,"cut":false,"hidden":false,"merged":[]}
["TAXA DE JUROS",null,null,null,null,null,null,null,null,null,null,"2020-02-05"]
["BMF Bovespa - Taxa de Juros"]
["DI1 - Depósito Interfinanceiro de um dia",null,null,null,null,null,null,null,null,null,null,null,{"$f":"BALANCEAMENTO!I2","v":0}]
["Dvc","DU","Ultima","Var","Neg","Cng","Cab","Mín","Máx","Abe","Ajut","Ajat"]
["2020-03-02",16,4.2,-0.23752999999999999,72,627035,1595378,4.1849999999999996,4.2030000000000003,4.1849999999999996,4.1970000000000001,4.1980000000000004,{"$f":"B5-$M$3","v":16}]
["2020-04-01",38,4.18,-0.11947000000000001,1627,634495,5521510,4.1660000000000004,4.1849999999999996,4.173,4.17,4.1740000000000004,{"$f":"B6-$M$3","v":38}]
["2020-05-04",58,4.1500000000000004,-0.24038999999999999,37,26295,218825,4.1470000000000002,4.1500000000000004,4.1500000000000004,4.1500000000000004,4.1509999999999998,58]
["2020-06-01",78,4.16,-0.12005,3,270,125280,4.16,4.18,4.16,4.1429999999999998,4.1470000000000002,78]
["2020-07-01",99,4.1550000000000002,0,1413,364175,5266707,4.13,4.16,4.1449999999999996,4.1399999999999997,4.1420000000000003,99]
["2020-08-03",122,4.1550000000000002,0.24126,1,200,72720,4.1550000000000002,4.1550000000000002,4.1550000000000002,4.1429999999999998,4.1479999999999997,122]
["2020-09-01",143,4.1500000000000004,0.12063,6,550,37370,4.1500000000000004,4.1500000000000004,4.1500000000000004,4.1449999999999996,4.1429999999999998,143]
["2020-10-01",164,4.21,0.11891,458,66570,695068,4.1849999999999996,4.21,4.1950000000000003,4.1849999999999996,4.194,164]
["2020-11-03",185,4.22,-0.23641000000000001,6,685,37945,4.21,4.22,4.21,4.21,4.2190000000000003,185]
["2020-12-01",205,4.25,0.33050000000000002,35,5075,37095,4.24,4.25,4.24,4.2279999999999998,4.2350000000000003,205]
["2021-01-04",227,4.32,0.34843000000000002,2752,430415,4303082,4.2750000000000004,4.3250000000000002,4.2850000000000001,4.29,4.2949999999999999,227]
["2021-04-01",288,4.45,0.45146999999999998,165,12590,549347,4.4000000000000004,4.45,4.41,4.42,4.42,288]
["2021-07-01",350,4.6100000000000003,0.21739,943,36205,902722,4.55,4.6100000000000003,4.58,4.57,4.5810000000000004,350]
["2021-10-01",415,4.7699999999999996,-0.41754000000000002,62,2145,449222,4.7300000000000004,4.7699999999999996,4.74,4.7300000000000004,4.7510000000000003,415]
["2022-01-03",478,4.92,0,3269,272275,1392762,4.87,4.92,4.9000000000000004,4.8899999999999997,4.9109999999999996,478]
["2022-04-01",540,5.07,0,99,5650,146310,5.04,5.07,5.04,5.05,5.0709999999999997,540]
{"$rows_left_out":8}
{"sheet":"FERIADOS","index":7,"n_rows":62,"n_cols":12,"rows_kept":62,"cut":false,"hidden":false,"merged":[]}
["2009-01-01","2009-02-23","2009-02-24","2009-04-10","2009-04-21","2009-05-01","2009-06-11","2009-09-07","2009-10-12","2009-11-02","2009-11-15","2009-12-25"]
["2010-01-01","2010-02-15","2010-02-16","2010-04-02","2010-04-21","2010-05-01","2010-06-03","2010-09-07","2010-10-12","2010-11-02","2010-11-15","2010-12-25"]
["2011-01-01","2011-03-07","2011-03-08","2011-04-21","2011-04-22","2011-05-01","2011-06-23","2011-09-07","2011-10-12","2011-11-02","2011-11-15","2011-12-25"]
["2012-01-01","2012-02-20","2012-02-21","2012-04-06","2012-04-21","2012-05-01","2012-06-07","2012-09-07","2012-10-12","2012-11-02","2012-11-15","2012-12-25"]
["2013-01-01","2013-02-11","2013-02-12","2013-03-29","2013-04-21","2013-05-01","2013-05-30","2013-09-07","2013-10-12","2013-11-02","2013-11-15","2013-12-25"]
["2014-01-01","2014-03-03","2014-03-04","2014-04-18","2014-04-21","2014-05-01","2014-06-19","2014-09-07","2014-10-12","2014-11-02","2014-11-15","2014-12-25"]
["2015-01-01","2015-02-16","2015-02-17","2015-04-03","2015-04-21","2015-05-01","2015-06-04","2015-09-07","2015-10-12","2015-11-02","2015-11-15","2015-12-25"]
["2016-01-01","2016-02-08","2016-02-09","2016-03-25","2016-04-21","2016-05-01","2016-05-26","2016-09-07","2016-10-12","2016-11-02","2016-11-15","2016-12-25"]
["2017-01-01","2017-02-27","2017-02-28","2017-04-14","2017-04-21","2017-05-01","2017-06-15","2017-09-07","2017-10-12","2017-11-02","2017-11-15","2017-12-25"]
["2018-01-01","2018-02-12","2018-02-13","2018-03-30","2018-04-21","2018-05-01","2018-05-31","2018-09-07","2018-10-12","2018-11-02","2018-11-15","2018-12-25"]
["2019-01-01","2019-03-04","2019-03-05","2019-04-19","2019-04-21","2019-05-01","2019-06-20","2019-09-07","2019-10-12","2019-11-02","2019-11-15","2019-12-25"]
["2020-01-01","2020-02-24","2020-02-25","2020-04-10","2020-04-21","2020-05-01","2020-06-11","2020-09-07","2020-10-12","2020-11-02","2020-11-15","2020-12-25"]
["2021-01-01","2021-02-15","2021-02-16","2021-04-02","2021-04-21","2021-05-01","2021-06-03","2021-09-07","2021-10-12","2021-11-02","2021-11-15","2021-12-25"]
["2022-01-01","2022-02-28","2022-03-01","2022-04-15","2022-04-21","2022-05-01","2022-06-16","2022-09-07","2022-10-12","2022-11-02","2022-11-15","2022-12-25"]
["2023-01-01","2023-02-20","2023-02-21","2023-04-07","2023-04-21","2023-05-01","2023-06-08","2023-09-07","2023-10-12","2023-11-02","2023-11-15","2023-12-25"]
["2024-01-01","2024-02-12","2024-02-13","2024-03-29","2024-04-21","2024-05-01","2024-05-30","2024-09-07","2024-10-12","2024-11-02","2024-11-15","2024-12-25"]
["2025-01-01","2025-03-03","2025-03-04","2025-04-18","2025-04-21","2025-05-01","2025-06-19","2025-09-07","2025-10-12","2025-11-02","2025-11-15","2025-12-25"]
["2026-01-01","2026-02-16","2026-02-17","2026-04-03","2026-04-21","2026-05-01","2026-06-04","2026-09-07","2026-10-12","2026-11-02","2026-11-15","2026-12-25"]
["2027-01-01","2027-02-08","2027-02-09","2027-03-26","2027-04-21","2027-05-01","2027-05-27","2027-09-07","2027-10-12","2027-11-02","2027-11-15","2027-12-25"]
["2028-01-01","2028-02-28","2028-02-29","2028-04-14","2028-04-21","2028-05-01","2028-06-15","2028-09-07","2028-10-12","2028-11-02","2028-11-15","2028-12-25"]
{"$rows_left_out":42}